channels
type: Concept
broader: marketing
definition: A channel means a narrow but deep route connecting two entities. Business entities use channels to connect themselves with their customers. [Source: Encyclopedia of Business in Today's World; Channels]

concepts
type: Collection
type: ConceptGroup
member: channels

marketing
type: Concept
narrower: channels