child-parent attachment
type: Concept
broader: parenting
definition: Attachments are the emotional bonds that infants develop with their parents and parent figures. Undoubtedly, the most popular theory of attachment formation was put forward by John Bowlby (1969). [Source: Encyclopedia of Applied Developmental Science; Attachment, Child-Parent]

concepts
type: Collection
type: ConceptGroup
member: child-parent attachment

parenting
type: Concept
narrower: child-parent attachment