cognitive ethology
type: Concept
broader: ethology
definition: Cognitive ethology is the study of higher mental functions in animals. Until about 1980, the possibility of cognitive powers in animals was largely denied. [Source: Encyclopedia of Anthropology; Ethology, Cognitive]

concepts
type: Collection
type: ConceptGroup
member: cognitive ethology

ethology
type: Concept
narrower: cognitive ethology