college student career development
type: Concept
broader: the evolution and development of careers
definition: College student career development refers to the processes involved in making career decisions and the outcomes of those decisions for individuals in college. According to developmental theories of career decision making, traditional-age college students are often attempting to refine their understanding of themselves, learn about the world of work, and discover how they might make work a part of their lives. [Source: Encyclopedia of Career Development; College Student Career Development]

concepts
type: Collection
type: ConceptGroup
member: college student career development

the evolution and development of careers
type: Concept
narrower: college student career development