comparative multicultural education
type: Concept
broader: global dimensions of diversity
definition: Comparative multicultural education can be seen either as a subfield of comparative education or as a subfield of multicultural education. Comparativists and multiculturalists approach the area in slightly different ways because they come from different traditions. [Source: Encyclopedia of Diversity in Education; Comparative Multicultural Education]

concepts
type: Collection
type: ConceptGroup
member: comparative multicultural education

global dimensions of diversity
type: Concept
narrower: comparative multicultural education