comprehensive school reform
type: Concept
broader: professional development
definition: Comprehensive school reform (CSR) has provided the primary paradigm for improving low-performing public schools in the latter part of the 20th century and early 21st century. New strategies for improving schools have emerged out of failures of the past. [Source: Encyclopedia of Educational Reform and Dissent; Comprehensive School Reform]

concepts
type: Collection
type: ConceptGroup
member: comprehensive school reform

professional development
type: Concept
narrower: comprehensive school reform