computational models of space
type: Concept
broader: geographic information systems
definition: Computational models of space are ways in which space is represented to solve spatial problems from given inputs by means of algorithms. The development of computational models of space relates closely to how space is conceptualized: as discrete objects or as continuous fields. [Source: Encyclopedia of Human Geography; Computational Models of Space]

concepts
type: Collection
type: ConceptGroup
member: computational models of space

geographic information systems
type: Concept
narrower: computational models of space