concepts
type: Collection
type: ConceptGroup
member: congressional record

congressional procedures
type: Concept
narrower: congressional record

congressional record
type: Concept
broader: congressional procedures
definition: The Congressional Record is the primary source of information about what happens on the floors of the Senate and House of Representatives. The Record, published daily when Congress is in session, provides an officially sanctioned account of each chamber's debate and shows how individual members voted on many issues. [Source: Congress A to Z; Congressional Record]