concepts
type: Collection
type: ConceptGroup
member: consolidated plans

consolidated plans
type: Concept
broader: industry
definition: The Consolidated Plan is a strategic plan for housing and community development required by the U.S. Department of Housing and Urban Development (HUD) as a condition for participation in various federal programs, including the Community Development Block Grant (CDBG), HOME Investment Partnerships (HOME), Emergency Shelter Grants (ESG), and Housing Opportunities for Persons with AIDS (HOPWA). Other HUD programs require that a jurisdiction receiving funds have a Consolidated Plan approved by HUD or certification that the application to be funded is consistent with the Consolidated Plan. [Source: The Encyclopedia of Housing; Consolidated Plans]

industry
type: Concept
narrower: consolidated plans