concepts
type: Collection
type: ConceptGroup
member: constructivist models of policy

constructivist models of policy
type: Concept
broader: public policy
definition: Social constructivists depart from the assumption that reality is what Peter Berger and Thomas Luckmann call social reality. To say that reality is socially constructed is to say that social reality is the product of human ways of knowing and communicating. [Source: International Encyclopedia of Political Science; Policy, Constructivist Models]

public policy
type: Concept
narrower: constructivist models of policy