concepts
type: Collection
type: ConceptGroup
member: contingent coordination

contingent coordination
type: Concept
broader: issues in crisis management
definition: Coordination within an organization is often viewed as a critical factor in success. Effective coordination ensures that all organizational activities are working in an aligned manner, recognizing that the functional areas within any organization are often interdependent. [Source: Encyclopedia of Crisis Management; Contingent Coordination]

issues in crisis management
type: Concept
narrower: contingent coordination