communication processes
type: Concept
narrower: conversational interruptions

concepts
type: Collection
type: ConceptGroup
member: conversational interruptions

conversational interruptions
type: Concept
broader: communication processes
definition: An interruption is a speech behavior that occurs when one person begins talking when another person is already talking and the original speaker stops talking. Interruptions can have implications for relationships depending on how they are interpreted. [Source: Encyclopedia of Human Relationships; Interruptions, Conversational]