concepts
type: Collection
type: ConceptGroup
member: coptic monasticism

coptic monasticism
type: Concept
broader: theology
definition: Christianity was introduced into Egypt in the 1st century and found itself in competition with two other religions: Judaism and the Hellenized native religion. By the 4th century, Christianity was the religion of the majority of the people in Egypt. [Source: Encyclopedia of Anthropology; Coptic Monasticism]

theology
type: Concept
narrower: coptic monasticism