concepts
type: Collection
type: ConceptGroup
member: corporate directors

corporate directors
type: Concept
broader: management ethics
definition: Corporate directors are the elected representatives of shareholders, put in place to safeguard the interests of the investors who bear the residual financial risk of their firms. They make up one third of the corporate governance triumvirate of executives, investors, and directors. [Source: Encyclopedia of Business Ethics and Society; Directors, Corporate]

management ethics
type: Concept
narrower: corporate directors