concepts
type: Collection
type: ConceptGroup
member: county fairs

county fairs
type: Concept
broader: rural life
definition: County fairs are actually one variety of a larger institution: the American agricultural fair (other variants include state fairs and smaller district fairs). Competitive exhibits of farm and domestic produce are central to these annual, generally rural, celebrations. [Source: Encyclopedia of Community: From the Village to the Virtual World; County Fairs]

rural life
type: Concept
narrower: county fairs