concepts
type: Collection
type: ConceptGroup
member: creative problem solving

creative problem solving
type: Concept
broader: creativity studies
definition: Creative problem solving that characterizes great accomplishment is based upon “regular” problem-solving skills. Problem solvers need to have extensive detailed knowledge of a subject matter before they begin to solve a problem, because problem solving relies upon application of prior knowledge and expertise. [Source: Encyclopedia of Giftedness, Creativity, and Talent; Creative Problem Solving]

creativity studies
type: Concept
narrower: creative problem solving