concepts
type: Collection
type: ConceptGroup
member: creativity theories

creativity studies
type: Concept
narrower: creativity theories

creativity theories
type: Concept
broader: creativity studies
definition: Creativity is one of the most important assets of the human mind. It has played an essential role in cultural and technological evolution in every era. [Source: Encyclopedia of Giftedness, Creativity, and Talent; Creativity Theories]