concepts
type: Collection
type: ConceptGroup
member: crime trends

crime
type: Concept
narrower: crime trends

crime trends
type: Concept
broader: crime
definition: Crime has plagued societies throughout history, but the prevalence of various types of crimes has changed over time. International and cross-cultural comparisons of crime exhibit interesting trends. [Source: Encyclopedia of Law & Society: American and Global Perspectives; Crime Trends]