concepts
type: Collection
type: ConceptGroup
member: critical praxis

critical praxis
type: Concept
broader: curriculum theory
definition: Praxis is the union of action and reflection and of theory and practice. Paulo Freire refers to praxis as the reassertion of human action for a more human world on two levels, the individual and social, where the simultaneous changing of circumstances and self-change occur. [Source: Encyclopedia of Curriculum Studies; Critical Praxis]

curriculum theory
type: Concept
narrower: critical praxis