concepts
type: Collection
type: ConceptGroup
member: critique of Enlightenment

critique of Enlightenment
type: Concept
broader: general philosophy
definition: This entry presents the critical voices the Enlightenment attracted against itself both during its heyday and more recently, when what is known as “the Enlightenment project” became the subject of critical controversy. The tenets of Enlightenment have been vital both to political philosophy and to the rise of modern social sciences. [Source: Encyclopedia of Philosophy and the Social Sciences; Enlightenment, Critique of]

general philosophy
type: Concept
narrower: critique of Enlightenment