concepts
type: Collection
type: ConceptGroup
member: customs broker

customs broker
type: Concept
broader: international trade
definition: A customs broker is a company or individual licensed by the host country to act on behalf of importers and exporters. The broker handles the formal paperwork to assure legal compliance and speed in the importing process. [Source: Encyclopedia of Business in Today's World; Customs Broker]

international trade
type: Concept
narrower: customs broker