methods
type: Collection
type: ConceptGroup
member: data reconstruction

data reconstruction
type: Concept
broader: meta-analysis
definition: In ∗meta-analysis, any of various methods for using research findings to calculate data not reported. This is done so that the person conducting a meta-analysis can compare or combine the results of different studies that do not report their results in the same way. [Source: Dictionary of Statistics & Methodology; Data Reconstruction]

meta-analysis
type: Concept
narrower: data reconstruction