concepts
type: Collection
type: ConceptGroup
member: debriefing

debriefing
type: Concept
broader: issues in crisis management
definition: Debriefing is a process used to assist people in dealing with a distressing or traumatic event. It is a form of crisis intervention and, as such, usually occurs soon after the traumatic event. [Source: Encyclopedia of Trauma: An Interdisciplinary Guide; Debriefing]

issues in crisis management
type: Concept
narrower: debriefing