concepts
type: Collection
type: ConceptGroup
member: diagnosticity

diagnosticity
type: Concept
broader: social cognition
definition: Definition Diagnosticity refers to the extent to which a source of data can discriminate between a particular hypothesis and its alternatives. In social situations, individuals often observe others' behaviors and attempt to form an impression about their personality and aptitudes. [Source: Encyclopedia of Social Psychology; Diagnosticity]

social cognition
type: Concept
narrower: diagnosticity