concepts
type: Collection
type: ConceptGroup
member: digitizing

digitizing
type: Concept
broader: geographic information systems
definition: Digitizing or digitization is a process that represents an object, image, or document by a discrete set of points, lines, polygons, or raster images. The result is called a digital representation or a digital image of the object represented. [Source: Encyclopedia of Geography; Digitizing]

geographic information systems
type: Concept
narrower: digitizing