concepts
type: Collection
type: ConceptGroup
member: direct export

direct export
type: Concept
broader: export/import strategies
definition: Direct exporting involves personally handling every aspect of the exporting process from market research and planning to foreign distribution and collections. Therefore, a significant commitment of management time and attention is required to achieve superior results, making this the most ambitious form of exporting. [Source: Encyclopedia of Business in Today's World; Direct Export]

export/import strategies
type: Concept
narrower: direct export