card games
type: Concept
narrower: donkey

concepts
type: Collection
type: ConceptGroup
member: donkey

donkey
type: Concept
broader: card games
definition: Donkey is a children's card game played with a traditional 52-card deck, in which cards are exchanged between players (instead of being played into a pool as in more complicated games). Special Donkey decks are often sold, with various animals in place of the usual four suits. [Source: Encyclopedia of Play in Today's Society; Donkey]