concepts
type: Collection
type: ConceptGroup
member: drive-by shooting

drive-by shooting
type: Concept
broader: gun violence
definition: Drive by shootings, colloquially known simply as “drive-bys,” are a tactic used by urban guerrillas, political assassins, terrorists, and criminal gangs. Drive-bys are armed attacks made from moving or momentarily stopped vehicles against individuals in the open, in other vehicles, or in structures. [Source: Encyclopedia of Street Crime in America; Drive-By Shooting]

gun violence
type: Concept
narrower: drive-by shooting