climate feedback
type: Concept
narrower: dynamical feedbacks

concepts
type: Collection
type: ConceptGroup
member: dynamical feedbacks

dynamical feedbacks
type: Concept
broader: climate feedback
definition: A DYNAMICAL FEEDBACK is a relationship within a system in which the effects caused by one part of the system on another part eventually come back to affect the first part. The easiest such relationship to envision might be a tug of war, in which each side has to pull harder, causing the other side to pull harder, causing the first side to pull harder still. [Source: Encyclopedia of Global Warming and Climate Change; Dynamical Feedbacks]