concepts
type: Collection
type: ConceptGroup
member: e-counseling

e-counseling
type: Concept
broader: subdisciplines
definition: One reflection of the explosion of technology in our lives is the increasing use of technology for delivering counseling and psychotherapy as well as other psychoeducational interventions. An individual can use the Internet to locate a counselor, to gain information about psychological conditions and treatments, to obtain counseling, and to share with others in chat rooms or online support groups. [Source: Encyclopedia of Counseling; E-Counseling]

subdisciplines
type: Concept
narrower: e-counseling