concepts
type: Collection
type: ConceptGroup
member: eco-warriors

eco-warriors
type: Concept
broader: population and environment
definition: In recent years a set of related movements, sometimes referred to as “radical environmentalism,” has appeared on the global stage. Despite precursors in history, what is new about these movements is the confrontational nature of the tactics they often employ, including blockades, tree spiking, forest occupations, and property destruction. [Source: Encyclopedia of Social Problems; Environment, Eco-Warriors]

population and environment
type: Concept
narrower: eco-warriors