methods
type: Collection
type: ConceptGroup
member: ecological analysis

ecological analysis
type: Concept
broader: science, technology and politics
definition: Ecological analysis is an effort to incorporate environmental and natural science notions into traditional political analysis. It is based on the premise that the study of government and societies can be enhanced by progress in understanding the planet's ecology. [Source: The Encyclopedia of Political Science; Ecological Analysis]

science, technology and politics
type: Concept
narrower: ecological analysis