concepts
type: Collection
type: ConceptGroup
member: ecological regimes

ecological regimes
type: Concept
broader: environment and people
definition: Ecological regimes can be defined as the way societies, institutions, or groups manage relations to their physical environment. This notion designates fields of activity, which are as such normatively regulated and which thereby determine relations between social and physical structures. [Source: Encyclopedia of Geography; Ecological Regimes]

environment and people
type: Concept
narrower: ecological regimes