concepts
type: Collection
type: ConceptGroup
member: ecological resilience

conservation and ecology
type: Concept
narrower: ecological resilience

ecological resilience
type: Concept
broader: conservation and ecology
definition: Natural systems are dynamic, complex, and interdependent. Ecological resilience describes the amount of change such a system can undergo and still remain within the same state. [Source: Encyclopedia of Environment and Society; Resilience, Ecological]