concepts
type: Collection
type: ConceptGroup
member: edge city

edge city
type: Concept
broader: urban geography
definition: Edge city is a term used to refer to the edge of an urban area, an area dense with businesses, entertainment, shopping, and recreation. Some argue it has become the major form of urban growth worldwide, pushing residential suburbs even farther aware from the urban core. [Source: Encyclopedia of Urban Studies; Edge City]

urban geography
type: Concept
narrower: edge city