advertising
type: Concept
narrower: effects of cigarette advertising

concepts
type: Collection
type: ConceptGroup
member: effects of cigarette advertising

effects of cigarette advertising
type: Concept
broader: advertising
definition: Cigarette smoking continues to be the number one preventable cause of death in the United States. Historically, more than 80% of all smokers began prior to age 18. [Source: Encyclopedia of Children, Adolescents, and the Media; Cigarette Advertising, Effects of]