concepts
type: Collection
type: ConceptGroup
member: effects of violence

effects of violence
type: Concept
broader: violence and aggression
definition: For more than 50 years, social scientists have conducted research on the effects of violent media, including TV programs, films, and video games. Researchers have found evidence of three different effects of media violence: 1. [Source: Encyclopedia of Children, Adolescents, and the Media; Violence, Effects of]

violence and aggression
type: Concept
narrower: effects of violence