concepts
type: Collection
type: ConceptGroup
member: electoral cycles

electoral cycles
type: Concept
broader: representation and electoral systems
definition: An electoral cycle is the period of time between two elections. Subject to specific electoral laws, electoral cycles are usually four or five years in length. [Source: The Encyclopedia of Political Science; Electoral Cycles]

representation and electoral systems
type: Concept
narrower: electoral cycles