concepts
type: Collection
type: ConceptGroup
member: encoding

encoding
type: Concept
broader: social cognition
definition: Encoding information is the cognitive process through which experiences are translated into memory. However, for the social sciences, encoding often means the process of translating thoughts, ideas, or questions into words. [Source: Encyclopedia of Survey Research Methods; Encoding]

social cognition
type: Concept
narrower: encoding