concepts
type: Collection
type: ConceptGroup
member: engaged scholarship

educational research
type: Concept
narrower: engaged scholarship

engaged scholarship
type: Concept
broader: educational research
definition: The engagement of practitioners within the action research field is a source of ongoing debate. This entry argues that engaged scholarship addresses this issue by locating action research in the wider domain of research perspectives ranging from basic research to co-production of knowledge and design science. [Source: The SAGE Encyclopedia of Action Research; Engaged Scholarship]