concepts
type: Collection
type: ConceptGroup
member: environmental activism

environmental activism
type: Concept
broader: social science of networking
definition: Environmental movements have been described as some of the most important of the 20th century. A significant aspect of these movements, as with most social movements, is the role of social networks. [Source: Encyclopedia of Social Networks; Environmental Activism]

social science of networking
type: Concept
narrower: environmental activism