concepts
type: Collection
type: ConceptGroup
member: ethical imperialism

ethical imperialism
type: Concept
broader: theories of ethics
definition: Ethical imperialism (which directs people to do everywhere exactly as they do at home) is the term used to describe a situation where a code of ethical behavior or attitude is imposed on another community or society. It is normally used in a derogatory or pejorative sense. [Source: Encyclopedia of Business Ethics and Society; Ethical Imperialism]

theories of ethics
type: Concept
narrower: ethical imperialism