methods
type: Collection
type: ConceptGroup
member: evaluation design

evaluation design
type: Concept
broader: qualitative evaluation
definition: The design is the methodological blueprint of an evaluation. It outlines the overall approach and plan for conducting the evaluation. [Source: Encyclopedia of Evaluation; Design, Evaluation]

qualitative evaluation
type: Concept
narrower: evaluation design