concepts
type: Collection
type: ConceptGroup
member: evil

evil
type: Concept
broader: theology
definition: The concept of evil appears in most African societies. In the construction of African religion, the people have always recognized that all things were not good. [Source: Encyclopedia of African Religion; Evil]

theology
type: Concept
narrower: evil