concepts
type: Collection
type: ConceptGroup
member: export management company

export/import strategies
type: Concept
narrower: export management company

export management company
type: Concept
broader: export/import strategies
definition: Export management companies (EMCs) act for contracting organizations as outsourced international trade intermediaries for products or services in overseas markets, usually in lieu of an in-house export or international marketing department. Offering full-service export assistance, EMCs can vary in size, scope, geographic areas of operations, and level of specific technical or product expertise. [Source: Encyclopedia of Business in Today's World; Export Management Company]