concepts
type: Collection
type: ConceptGroup
member: eyewitness identification: field studies

eyewitness identification: field studies
type: Concept
broader: eyewitness memory
definition: A substantial base of laboratory research is now available to aid our understanding of eyewitness identification processes and to support recommendations for lineup reform. However, there are also a limited number of peer-reviewed, published studies that measure eyewitness responses in real police cases. [Source: Encyclopedia of Psychology and Law; Eyewitness Identification: Field Studies]

eyewitness memory
type: Concept
narrower: eyewitness identification: field studies