concepts
type: Collection
type: ConceptGroup
member: family creativity

creativity studies
type: Concept
narrower: family creativity

family creativity
type: Concept
broader: creativity studies
definition: The link between family and creativity has longstanding, mythic origins. In Greek mythology, the Nine Muses were seen as the sources of inspiration and the creative spark in the arts and sciences. [Source: Encyclopedia of Giftedness, Creativity, and Talent; Family Creativity]