concepts
type: Collection
type: ConceptGroup
member: flexible housing

flexible housing
type: Concept
broader: housing technology
definition: Flexible housing is housing that can adjust to the needs of the user, both at point of design and over time. It is also a form of housing that can accommodate new technologies as they emerge. [Source: The Encyclopedia of Housing; Flexible Housing]

housing technology
type: Concept
narrower: flexible housing