concepts
type: Collection
type: ConceptGroup
member: flight

flight
type: Concept
broader: society
definition: Flight is the process of moving through the air. It occurs among many animals, notably birds, which employ true or powered flight through the use of wings and specially adapted bone and feather structures. [Source: Encyclopedia of Environment and Society; Flight]

society
type: Concept
narrower: flight