concepts
type: Collection
type: ConceptGroup
member: follower-oriented leadership

follower-oriented leadership
type: Concept
broader: followership
definition: Leadership is a symbiotic relationship between those who choose to lead and those who choose to follow. Any discussion of leadership must attend to the dynamics of this relationship. [Source: Encyclopedia of Leadership; Follower-Oriented Leadership]

followership
type: Concept
narrower: follower-oriented leadership